Reaction Details
TargetSodium-dependent serotonin transporter
LigandBDBM50047085
Substrate/Competitorn/a
Meas. Tech.ChEMBL_198045 (CHEMBL804187)
IC50 5±n/a nM
Citation Malleron, JLGuérémy, CMignani, SPeyronel, JFTruchon, ABlanchard, JCDoble, ALaduron, PPiot, OZundel, JL New indole derivatives as potent and selective serotonin uptake inhibitors. J Med Chem36:1194-202 (1993) Sodium-dependent serotonin transporter
Name:Sodium-dependent serotonin transporter
Type:Multi-pass membrane protein
Mol. Mass.:70168.43
Organism:Rattus norvegicus (rat)
Description:P31652
Residue:630
BDBM50047085
NameBDBM50047085
Synonyms:2-{2-[4-(5-Fluoro-1H-indol-3-ylmethyl)-piperazin-1-yl]-ethyl}-2H-naphtho[1,8-cd]isothiazole 1,1-dioxide | CHEMBL276922
TypeSmall organic molecule
Emp. Form.C25H25FN4O2S
Mol. Mass.464.555
SMILESFc1ccc2[nH]cc(CN3CCN(CCN4c5cccc6cccc(c56)S4(=O)=O)CC3)c2c1