Reaction Details
TargetType-1 angiotensin II receptor
LigandBDBM50047111
Substrate/Competitorn/a
Meas. Tech.ChEMBL_36780 (CHEMBL650301)
IC50 5±n/a nM
Citation Bradbury, RHAllott, CPDennis, MGirdwood, JAKenny, PWMajor, JSOldham, AARatcliffe, AHRivett, JERoberts, DA New nonpeptide angiotensin II receptor antagonists. 3. Synthesis, biological properties, and structure-activity relationships of 2-alkyl-4-(biphenylylmethoxy)pyridine derivatives. J Med Chem36:1245-54 (1993) Type-1 angiotensin II receptor
Name:Type-1 angiotensin II receptor
Type:PROTEIN
Mol. Mass.:41004.19
Organism:Cavia porcellus
Description:ChEMBL_36783
Residue:359
BDBM50047111
NameBDBM50047111
Synonyms:6-Ethyl-2-methyl-4-[2'-(1H-tetrazol-5-yl)-biphenyl-4-ylmethoxy]-nicotinic acid methyl ester | CHEMBL283742
TypeSmall organic molecule
Emp. Form.C24H23N5O3
Mol. Mass.429.4711
SMILESCCc1cc(OCc2ccc(cc2)-c2ccccc2-c2nnn[nH]2)c(C(=O)OC)c(C)n1