Reaction Details
TargetAdenosine receptor A1
LigandBDBM50047159
Substrate/Competitorn/a
Meas. Tech.ChEBML_29455
Ki 32±n/a nM
Citation Jacobson, KAGallo-Rodriguez, CMelman, NFischer, BMaillard, Mvan Bergen, Avan Galen, PJKarton, Y Structure-activity relationships of 8-styrylxanthines as A2-selective adenosine antagonists. J Med Chem36:1333-42 (1993) Adenosine receptor A1
Name:Adenosine receptor A1
Type:Protein
Mol. Mass.:36704.13
Organism:Rattus norvegicus (rat)
Description:n/a
Residue:326
BDBM50047159
NameBDBM50047159
Synonyms:1,3-Dimethyl-7-phenethyl-8-[2-(3,4,5-trimethoxy-phenyl)-vinyl]-3,7-dihydro-purine-2,6-dione | CHEMBL283939
TypeSmall organic molecule
Emp. Form.C26H28N4O5
Mol. Mass.476.5243
SMILESCOc1cc(\C=C\c2nc3n(C)c(=O)n(C)c(=O)c3n2CCc2ccccc2)cc(OC)c1OC