Reaction Details
TargetAdenosine receptor A1
LigandBDBM50047154
Substrate/Competitorn/a
Meas. Tech.ChEBML_29455
Ki 167±n/a nM
Citation Jacobson, KAGallo-Rodriguez, CMelman, NFischer, BMaillard, Mvan Bergen, Avan Galen, PJKarton, Y Structure-activity relationships of 8-styrylxanthines as A2-selective adenosine antagonists. J Med Chem36:1333-42 (1993) Adenosine receptor A1
Name:Adenosine receptor A1
Type:Protein
Mol. Mass.:36704.13
Organism:Rattus norvegicus (rat)
Description:n/a
Residue:326
BDBM50047154
NameBDBM50047154
Synonyms:8-[2-(3-Chloro-phenyl)-vinyl]-1,3-dipropyl-3,7-dihydro-purine-2,6-dione | CHEMBL28395
TypeSmall organic molecule
Emp. Form.C19H21ClN4O2
Mol. Mass.372.849
SMILESCCCn1c2nc(C=Cc3cccc(Cl)c3)[nH]c2c(=O)n(CCC)c1=O