Reaction Details
TargetAdenosine receptor A1
LigandBDBM50006711
Substrate/Competitorn/a
Meas. Tech.ChEBML_29455
Ki 71±n/a nM
Citation Jacobson, KAGallo-Rodriguez, CMelman, NFischer, BMaillard, Mvan Bergen, Avan Galen, PJKarton, Y Structure-activity relationships of 8-styrylxanthines as A2-selective adenosine antagonists. J Med Chem36:1333-42 (1993) Adenosine receptor A1
Name:Adenosine receptor A1
Type:Protein
Mol. Mass.:36704.13
Organism:Rattus norvegicus (rat)
Description:n/a
Residue:326
BDBM50006711
NameBDBM50006711
Synonyms:8-[2-(3,4-Dimethoxy-phenyl)-vinyl]-1,3-dipropyl-3,7-dihydro-purine-2,6-dione | CHEMBL27496
TypeSmall organic molecule
Emp. Form.C21H26N4O4
Mol. Mass.398.4555
SMILESCCCn1c2nc(C=Cc3ccc(OC)c(OC)c3)[nH]c2c(=O)n(CCC)c1=O