Reaction Details
TargetCytochrome P450 4A4
LigandBDBM50047305
Substrate/Competitorn/a
Meas. Tech.ChEBML_52074
Ki 4800±n/a nM
Citation Burger, AClark, JENishimoto, MMuerhoff, ASMasters, BSOrtiz de Montellano, PR Mechanism-based inhibitors of prostaglandin omega-hydroxylase: (R)- and (S)-12-hydroxy-16-heptadecynoic acid and 2,2-dimethyl-12-hydroxy-16-heptadecynoic acid. J Med Chem36:1418-24 (1993) Cytochrome P450 4A4
Name:Cytochrome P450 4A4
Type:PROTEIN
Mol. Mass.:58951.27
Organism:Oryctolagus cuniculus
Description:ChEMBL_52074
Residue:510
BDBM50047305
NameBDBM50047305
Synonyms:12-Hydroxy-heptadec-16-ynoic acid | CHEMBL29370
TypeSmall organic molecule
Emp. Form.C17H30O3
Mol. Mass.282.4183
SMILESOC(CCCCCCCCCCC(O)=O)CCCC#C