Reaction Details
TargetThromboxane-A synthase
LigandBDBM50010960
Substrate/Competitorn/a
Meas. Tech.ChEBML_207656
IC50 2.9±n/a nM
Citation Ohshima, ESato, HObase, HMiki, IIshii, AKawakage, MShirakura, SKarasawa, AKubo, K Dibenzoxepin derivatives: thromboxane A2 synthase inhibition and thromboxane A2 receptor antagonism combined in one molecule. J Med Chem36:1613-8 (1993) Thromboxane-A synthase
Name:Thromboxane-A synthase
Type:Enzyme
Mol. Mass.:60524.67
Organism:Homo sapiens (Human)
Description:P24557
Residue:533
BDBM50010960
NameBDBM50010960
Synonyms:(E)-7-Phenyl-7-pyridin-3-yl-hept-6-enoic acid 7-Phenyl-7-pyridin-3-yl-hept-6-enoic acid(CV-4151) CV-4151
TypeSmall organic molecule
Emp. Form.C18H19NO2
Mol. Mass.281.349
SMILESOC(=O)CCCC\C=C(/c1ccccc1)c1cccnc1