Reaction Details
TargetPlatelet-activating factor receptor
LigandBDBM50047772
Substrate/Competitorn/a
Meas. Tech.ChEMBL_221702 (CHEMBL823402)
IC50 100±n/a nM
Citation Trova, MPWissner, ACarroll, MLKerwar, SSPickett, WCSchaub, RETorley, LWKohler, CA Analogues of platelet activating factor. 8. Antagonists of PAF containing an aromatic ring linked to a pyridinium ring. J Med Chem36:580-90 (1993) Platelet-activating factor receptor
Name:Platelet-activating factor receptor
Type:Protein
Mol. Mass.:39005.63
Organism:Cavia porcellus
Description:n/a
Residue:342
BDBM50047772
NameBDBM50047772
Synonyms:CHEMBL349327 | Trifluoro-methanesulfonate2-{[acetyl-(3-methoxy-4-tetradecyloxy-benzoyl)-amino]-methyl}-1-propyl-pyridinium;
TypeSmall organic molecule
Emp. Form.C33H51N2O4
Mol. Mass.539.7685
c1ccc(cc1OC)C(=O)N(Cc1cccc[n+]1CCC)C(C)=O