Reaction Details
TargetAmine oxidase [flavin-containing] B
LigandBDBM50018453
Substrate/Competitorn/a
Meas. Tech.ChEBML_100077
Ki 7100000±n/a nM
Citation Ding, CZLu, XNishimura, KSilverman, RB Transformation of monoamine oxidase-B primary amine substrates into time-dependent inhibitors. Tertiary amine homologues of primary amine substrates. J Med Chem36:1711-5 (1993) Amine oxidase [flavin-containing] B
Name:Amine oxidase [flavin-containing] B
Type:PROTEIN
Mol. Mass.:58428.94
Organism:Bos taurus
Description:ChEMBL_1501478
Residue:520
BDBM50018453
NameBDBM50018453
Synonyms:CHEMBL46278 N,N-dimethyl-2-phenylethylamine
TypeSmall organic molecule
Emp. Form.C10H15N
Mol. Mass.149.2328
SMILESCN(C)CCc1ccccc1