Reaction Details
TargetSodium- and chloride-dependent creatine transporter 1
LigandBDBM50048110
Substrate/Competitorn/a
Meas. Tech.ChEMBL_216905 (CHEMBL821923)
IC50 221000±n/a nM
Citation Patel, PJMesser, WSHudson, RA Inhibition and inactivation of presynaptic cholinergic markers using redox-reactive choline analogs. J Med Chem36:1893-901 (1993) Sodium- and chloride-dependent creatine transporter 1
Name:Sodium- and chloride-dependent creatine transporter 1
Type:PROTEIN
Mol. Mass.:70632.63
Organism:Rattus norvegicus
Description:ChEMBL_49276
Residue:635
BDBM50048110
NameBDBM50048110
Synonyms:CHEMBL57055 | [2-(3,4-Dihydroxy-phenyl)-2-hydroxy-ethyl]-trimethyl-ammonium; iodide
TypeSmall organic molecule
Emp. Form.C11H18NO3
Mol. Mass.212.265
SMILESC[N+](C)(C)CC(O)c1ccc(O)c(O)c1