Reaction Details
TargetSodium- and chloride-dependent creatine transporter 1
LigandBDBM50048111
Substrate/Competitorn/a
Meas. Tech.ChEMBL_217034 (CHEMBL821568)
Ki 60000±n/a nM
Citation Patel, PJMesser, WSHudson, RA Inhibition and inactivation of presynaptic cholinergic markers using redox-reactive choline analogs. J Med Chem36:1893-901 (1993) Sodium- and chloride-dependent creatine transporter 1
Name:Sodium- and chloride-dependent creatine transporter 1
Type:PROTEIN
Mol. Mass.:70632.63
Organism:Rattus norvegicus
Description:ChEMBL_49276
Residue:635
BDBM50048111
NameBDBM50048111
Synonyms:(2,3-Dihydroxy-phenyl)-trimethyl-ammonium; iodide | CHEMBL57283
TypeSmall organic molecule
Emp. Form.C9H14NO2
Mol. Mass.168.2124
SMILESC[N+](C)(C)c1cccc(O)c1O