Reaction Details
TargetProgesterone receptor
LigandBDBM8903
Substrate/Competitorn/a
Meas. Tech.ChEMBL_159374 (CHEMBL768148)
IC50 5±n/a nM
Citation Combs, DWReese, KPhillips, A Nonsteroidal progesterone receptor ligands. 1. 3-Aryl-1-benzoyl-1,4,5,6-tetrahydropyridazines. J Med Chem38:4878-9 (1996) Progesterone receptor
Name:Progesterone receptor
Type:Protein
Mol. Mass.:98979.52
Organism:Homo sapiens (Human)
Description:P06401
Residue:933
BDBM8903
NameBDBM8903
Synonyms:(1S,2R,10S,11S,14S,15S)-14-acetyl-2,15-dimethyltetracyclo[8.7.0.0^{2,7}.0^{11,15}]heptadec-6-en-5-one progesterone
TypeSteroid
Emp. Form.C21H30O2
Mol. Mass.314.4617
SMILES[H][C@@]12CC[C@H](C(C)=O)[C@@]1(C)CC[C@@]1([H])[C@@]2([H])CCC2=CC(=O)CC[C@]12C