Reaction Details
TargetProstaglandin G/H synthase 2
LigandBDBM50048211
Substrate/Competitorn/a
Meas. Tech.ChEMBL_159598 (CHEMBL760080)
IC50 50±n/a nM
Citation Li, CSBlack, WCChan, CCFord-Hutchinson, AWGauthier, JYGordon, RGuay, DKargman, SLau, CKMancini, J Cyclooxygenase-2 inhibitors. Synthesis and pharmacological activities of 5-methanesulfonamido-1-indanone derivatives. J Med Chem38:4897-905 (1996) Prostaglandin G/H synthase 2
Name:Prostaglandin G/H synthase 2
Type:Enzyme
Mol. Mass.:69003.89
Organism:Homo sapiens (Human)
Description:Recombinant Cox-2 provided by Cayman (Cayman Chemical Co.,Ann Arbor, MI).
Residue:604
BDBM50048211
NameBDBM50048211
Synonyms:CHEMBL344959 | N-(6-Cyclohexyloxy-1-oxo-indan-5-yl)-methanesulfonamide
TypeSmall organic molecule
Emp. Form.C16H21NO4S
Mol. Mass.323.407
SMILESCS(=O)(=O)Nc1cc2CCC(=O)c2cc1OC1CCCCC1