Reaction Details
TargetProstaglandin G/H synthase 2
LigandBDBM50048215
Substrate/Competitorn/a
Meas. Tech.ChEMBL_159598 (CHEMBL760080)
IC50>10000±n/a nM
Citation Li, CSBlack, WCChan, CCFord-Hutchinson, AWGauthier, JYGordon, RGuay, DKargman, SLau, CKMancini, J Cyclooxygenase-2 inhibitors. Synthesis and pharmacological activities of 5-methanesulfonamido-1-indanone derivatives. J Med Chem38:4897-905 (1996) Prostaglandin G/H synthase 2
Name:Prostaglandin G/H synthase 2
Type:Enzyme
Mol. Mass.:69003.89
Organism:Homo sapiens (Human)
Description:Recombinant Cox-2 provided by Cayman (Cayman Chemical Co.,Ann Arbor, MI).
Residue:604
BDBM50048215
NameBDBM50048215
Synonyms:CHEMBL357163 | N-[6-(4-tert-Butyl-phenylsulfanyl)-1-oxo-indan-5-yl]-methanesulfonamide
TypeSmall organic molecule
Emp. Form.C20H23NO3S2
Mol. Mass.389.532
SMILESCC(C)(C)c1ccc(Sc2cc3C(=O)CCc3cc2NS(C)(=O)=O)cc1