Reaction Details
TargetcGMP-dependent 3',5'-cyclic phosphodiesterase
LigandBDBM50048241
Substrate/Competitorn/a
Meas. Tech.ChEMBL_156307 (CHEMBL762540)
Ki>100000±n/a nM
Citation Stafford, JAVeal, JMFeldman, PLValvano, NLBaer, PGBrackeen, MFBrawley, ESConnolly, KMDomanico, PLHan, B Introduction of a conformational switching element on a pyrrolidine ring. Synthesis and evaluation of (R*,R*)-(+/-)-methyl 3-acetyl-4-[3- (cyclopentyloxy)-4-methoxyphenyl]-3-methyl-1-pyrrolidinecarboxylate, a potent and selective inhibitor of cAMP-specific phosphodiesterase. J Med Chem38:4972-5 (1996) cGMP-dependent 3',5'-cyclic phosphodiesterase
Name:cGMP-dependent 3',5'-cyclic phosphodiesterase
Type:PROTEIN
Mol. Mass.:103200.18
Organism:Bos taurus
Description:ChEMBL_154420
Residue:921
BDBM50048241
NameBDBM50048241
Synonyms:(3S,4S)-3-Acetyl-4-(3-cyclopentyloxy-4-methoxy-phenyl)-3-methyl-pyrrolidine-1-carboxylic acid methyl ester | CHEMBL344944
TypeSmall organic molecule
Emp. Form.C21H29NO5
Mol. Mass.375.4587
SMILESCOC(=O)N1C[C@@H](c2ccc(OC)c(OC3CCCC3)c2)[C@@](C)(C1)C(C)=O