Reaction Details
TargetRetinoic acid receptor gamma
LigandBDBM50048279
Substrate/Competitorn/a
Meas. Tech.ChEMBL_196012 (CHEMBL798022)
Ki 426.0±n/a nM
Citation Charpentier, BBernardon, JMEustache, JMillois, CMartin, BMichel, SShroot, B Synthesis, structure-affinity relationships, and biological activities of ligands binding to retinoic acid receptor subtypes. J Med Chem38:4993-5006 (1996) Retinoic acid receptor gamma
Name:Retinoic acid receptor gamma
Type:PROTEIN
Mol. Mass.:50345.43
Organism:Homo sapiens (Human)
Description:ChEMBL_1458016
Residue:454
BDBM50048279
NameBDBM50048279
Synonyms:6-(3-tert-Butyl-4-methoxy-phenyl)-naphthalene-2-carboxylic acid | CHEMBL146092
TypeSmall organic molecule
Emp. Form.C22H22O3
Mol. Mass.334.4083
SMILESCOc1ccc(cc1C(C)(C)C)-c1ccc2cc(ccc2c1)C(O)=O