Reaction Details
TargetRetinoic acid receptor gamma
LigandBDBM50048281
Substrate/Competitorn/a
Meas. Tech.ChEMBL_196012 (CHEMBL798022)
Ki 40±n/a nM
Citation Charpentier, BBernardon, JMEustache, JMillois, CMartin, BMichel, SShroot, B Synthesis, structure-affinity relationships, and biological activities of ligands binding to retinoic acid receptor subtypes. J Med Chem38:4993-5006 (1996) Retinoic acid receptor gamma
Name:Retinoic acid receptor gamma
Type:PROTEIN
Mol. Mass.:50345.43
Organism:Homo sapiens (Human)
Description:ChEMBL_1458016
Residue:454
BDBM50048281
NameBDBM50048281
Synonyms:5',5',8',8'-Tetramethyl-5',6',7',8'-tetrahydro-[2,2']binaphthalenyl-6-carboxylic acid CHEMBL25361
TypeSmall organic molecule
Emp. Form.C25H26O2
Mol. Mass.358.4727
SMILESCC1(C)CCC(C)(C)c2cc(ccc12)-c1ccc2cc(ccc2c1)C(O)=O