Reaction Details
TargetRetinoic acid receptor gamma
LigandBDBM50048276
Substrate/Competitorn/a
Meas. Tech.ChEMBL_196012 (CHEMBL798022)
Ki 53±n/a nM
Citation Charpentier, BBernardon, JMEustache, JMillois, CMartin, BMichel, SShroot, B Synthesis, structure-affinity relationships, and biological activities of ligands binding to retinoic acid receptor subtypes. J Med Chem38:4993-5006 (1996) Retinoic acid receptor gamma
Name:Retinoic acid receptor gamma
Type:PROTEIN
Mol. Mass.:50345.43
Organism:Homo sapiens (Human)
Description:ChEMBL_1458016
Residue:454
BDBM50048276
NameBDBM50048276
Synonyms:4-[(E)-2-(3-Adamantan-1-yl-4-hydroxy-phenyl)-propenyl]-benzoic acid | CHEMBL421773
TypeSmall organic molecule
Emp. Form.C26H28O3
Mol. Mass.388.4987
SMILESC\C(=C/c1ccc(cc1)C(O)=O)c1ccc(O)c(c1)C12CC3CC(CC(C3)C1)C2