Reaction Details
TargetRetinoic acid receptor gamma
LigandBDBM50048287
Substrate/Competitorn/a
Meas. Tech.ChEMBL_196012 (CHEMBL798022)
Ki 121±n/a nM
Citation Charpentier, BBernardon, JMEustache, JMillois, CMartin, BMichel, SShroot, B Synthesis, structure-affinity relationships, and biological activities of ligands binding to retinoic acid receptor subtypes. J Med Chem38:4993-5006 (1996) Retinoic acid receptor gamma
Name:Retinoic acid receptor gamma
Type:PROTEIN
Mol. Mass.:50345.43
Organism:Homo sapiens (Human)
Description:ChEMBL_1458016
Residue:454
BDBM50048287
NameBDBM50048287
Synonyms:6-[4-Hydroxy-3-(1-methyl-cyclohexyl)-phenyl]-naphthalene-2-carboxylic acid | CHEMBL148231
TypeSmall organic molecule
Emp. Form.C24H24O3
Mol. Mass.360.4456
SMILESCC1(CCCCC1)c1cc(ccc1O)-c1ccc2cc(ccc2c1)C(O)=O