Reaction Details
TargetRetinoic acid receptor alpha
LigandBDBM50048292
Substrate/Competitorn/a
Meas. Tech.ChEMBL_197413 (CHEMBL799802)
Ki 1120±n/a nM
Citation Charpentier, BBernardon, JMEustache, JMillois, CMartin, BMichel, SShroot, B Synthesis, structure-affinity relationships, and biological activities of ligands binding to retinoic acid receptor subtypes. J Med Chem38:4993-5006 (1996) Retinoic acid receptor alpha
Name:Retinoic acid receptor alpha
Type:PROTEIN
Mol. Mass.:50778.87
Organism:Homo sapiens (Human)
Description:ChEMBL_1466191
Residue:462
BDBM50048292
NameBDBM50048292
Synonyms:6-[4-Methoxy-3-(1-methyl-cyclohexyl)-phenyl]-naphthalene-2-carboxylic acid | CHEMBL345298
TypeSmall organic molecule
Emp. Form.C25H26O3
Mol. Mass.374.4721
SMILESCOc1ccc(cc1C1(C)CCCCC1)-c1ccc2cc(ccc2c1)C(O)=O