Reaction Details
TargetRetinoic acid receptor alpha
LigandBDBM50048284
Substrate/Competitorn/a
Meas. Tech.ChEMBL_197413 (CHEMBL799802)
Ki 695±n/a nM
Citation Charpentier, BBernardon, JMEustache, JMillois, CMartin, BMichel, SShroot, B Synthesis, structure-affinity relationships, and biological activities of ligands binding to retinoic acid receptor subtypes. J Med Chem38:4993-5006 (1996) Retinoic acid receptor alpha
Name:Retinoic acid receptor alpha
Type:PROTEIN
Mol. Mass.:50778.87
Organism:Homo sapiens (Human)
Description:ChEMBL_1466191
Residue:462
BDBM50048284
NameBDBM50048284
Synonyms:6-[3-Adamantan-1-yl-4-(3-hydroxy-propyl)-phenyl]-naphthalene-2-carboxylic acid | CHEMBL357917
TypeSmall organic molecule
Emp. Form.C30H32O3
Mol. Mass.440.5733
SMILESOCCCc1ccc(cc1C12CC3CC(CC(C3)C1)C2)-c1ccc2cc(ccc2c1)C(O)=O