Reaction Details
TargetRetinoic acid receptor gamma
LigandBDBM50048290
Substrate/Competitorn/a
Meas. Tech.ChEMBL_196012 (CHEMBL798022)
Ki 85±n/a nM
Citation Charpentier, BBernardon, JMEustache, JMillois, CMartin, BMichel, SShroot, B Synthesis, structure-affinity relationships, and biological activities of ligands binding to retinoic acid receptor subtypes. J Med Chem38:4993-5006 (1996) Retinoic acid receptor gamma
Name:Retinoic acid receptor gamma
Type:PROTEIN
Mol. Mass.:50345.43
Organism:Homo sapiens (Human)
Description:ChEMBL_1458016
Residue:454
BDBM50048290
NameBDBM50048290
Synonyms:4-[(E)-2-(3-tert-Butyl-4-hydroxy-phenyl)-propenyl]-benzoic acid | CHEMBL348449
TypeSmall organic molecule
Emp. Form.C20H22O3
Mol. Mass.310.3869
SMILESC\C(=C/c1ccc(cc1)C(O)=O)c1ccc(O)c(c1)C(C)(C)C