Reaction Details
TargetRetinoic acid receptor gamma
LigandBDBM50048285
Substrate/Competitorn/a
Meas. Tech.ChEMBL_196012 (CHEMBL798022)
Ki 29±n/a nM
Citation Charpentier, BBernardon, JMEustache, JMillois, CMartin, BMichel, SShroot, B Synthesis, structure-affinity relationships, and biological activities of ligands binding to retinoic acid receptor subtypes. J Med Chem38:4993-5006 (1996) Retinoic acid receptor gamma
Name:Retinoic acid receptor gamma
Type:PROTEIN
Mol. Mass.:50345.43
Organism:Homo sapiens (Human)
Description:ChEMBL_1458016
Residue:454
BDBM50048285
NameBDBM50048285
Synonyms:4-{(E)-2-[4-Methoxy-3-(1-methyl-cyclohexyl)-phenyl]-propenyl}-benzoic acid | CHEMBL356326
TypeSmall organic molecule
Emp. Form.C24H28O3
Mol. Mass.364.4773
SMILESCOc1ccc(cc1C1(C)CCCCC1)C(\C)=C\c1ccc(cc1)C(O)=O