Reaction Details
TargetRetinoic acid receptor alpha
LigandBDBM50048281
Substrate/Competitorn/a
Meas. Tech.ChEMBL_197413 (CHEMBL799802)
Ki 580±n/a nM
Citation Charpentier, BBernardon, JMEustache, JMillois, CMartin, BMichel, SShroot, B Synthesis, structure-affinity relationships, and biological activities of ligands binding to retinoic acid receptor subtypes. J Med Chem38:4993-5006 (1996) Retinoic acid receptor alpha
Name:Retinoic acid receptor alpha
Type:PROTEIN
Mol. Mass.:50778.87
Organism:Homo sapiens (Human)
Description:ChEMBL_1466191
Residue:462
BDBM50048281
NameBDBM50048281
Synonyms:5',5',8',8'-Tetramethyl-5',6',7',8'-tetrahydro-[2,2']binaphthalenyl-6-carboxylic acid CHEMBL25361
TypeSmall organic molecule
Emp. Form.C25H26O2
Mol. Mass.358.4727
SMILESCC1(C)CCC(C)(C)c2cc(ccc12)-c1ccc2cc(ccc2c1)C(O)=O