Reaction Details
TargetRetinoic acid receptor beta
LigandBDBM50048297
Substrate/Competitorn/a
Meas. Tech.ChEMBL_195496 (CHEMBL798917)
Ki 89±n/a nM
Citation Charpentier, BBernardon, JMEustache, JMillois, CMartin, BMichel, SShroot, B Synthesis, structure-affinity relationships, and biological activities of ligands binding to retinoic acid receptor subtypes. J Med Chem38:4993-5006 (1996) Retinoic acid receptor beta
Name:Retinoic acid receptor beta
Type:PROTEIN
Mol. Mass.:50498.70
Organism:Homo sapiens (Human)
Description:ChEMBL_1458015
Residue:455
BDBM50048297
NameBDBM50048297
Synonyms:6-[3-Adamantan-1-yl-4-(2,3-dihydroxy-propoxy)-phenyl]-naphthalene-2-carboxylic acid | CHEMBL147545
TypeSmall organic molecule
Emp. Form.C30H32O5
Mol. Mass.472.5721
SMILESOCC(O)COc1ccc(cc1C12CC3CC(CC(C3)C1)C2)-c1ccc2cc(ccc2c1)C(O)=O