Reaction Details
TargetRetinoic acid receptor beta
LigandBDBM50048295
Substrate/Competitorn/a
Meas. Tech.ChEMBL_195496 (CHEMBL798917)
Ki 12±n/a nM
Citation Charpentier, BBernardon, JMEustache, JMillois, CMartin, BMichel, SShroot, B Synthesis, structure-affinity relationships, and biological activities of ligands binding to retinoic acid receptor subtypes. J Med Chem38:4993-5006 (1996) Retinoic acid receptor beta
Name:Retinoic acid receptor beta
Type:PROTEIN
Mol. Mass.:50498.70
Organism:Homo sapiens (Human)
Description:ChEMBL_1458015
Residue:455
BDBM50048295
NameBDBM50048295
Synonyms:4-[(E)-2-(3-tert-Butyl-4-methoxy-phenyl)-propenyl]-benzoic acid | CHEMBL74826
TypeSmall organic molecule
Emp. Form.C21H24O3
Mol. Mass.324.4135
SMILESCOc1ccc(cc1C(C)(C)C)C(\C)=C\c1ccc(cc1)C(O)=O