Reaction Details
TargetD(2) dopamine receptor
LigandBDBM50048299
Substrate/Competitorn/a
Meas. Tech.ChEMBL_61614 (CHEMBL672911)
Ki 25.5±n/a nM
Citation Wright, JLDowning, DMFeng, MRHayes, RNHeffner, TGMacKenzie, RGMeltzer, LTPugsley, TAWise, LD Identification, characterization and pharmacological profile of three metabolites of (R)-(+)-1,2,3,6-tetrahydro-4-phenyl-1-[(3-phenylcyclohexen-1- yl)methyl]pyridine (CI-1007), a dopamine autoreceptor agonist and potential antipsychotic agent. J Med Chem38:5007-14 (1996) D(2) dopamine receptor
Name:D(2) dopamine receptor
Type:Cell-surface receptors
Mol. Mass.:50647.10
Organism:Homo sapiens (Human)
Description:P14416
Residue:443
BDBM50048299
NameBDBM50048299
Synonyms:4-Phenyl-1-((R)-3-phenyl-cyclohex-3-enylmethyl)-1,2,3,6-tetrahydro-pyridine CI-1007
TypeSmall organic molecule
Emp. Form.C24H27N
Mol. Mass.329.4779
SMILESC([C@@H]1CCC=C(C1)c1ccccc1)N1CCC(=CC1)c1ccccc1