Reaction Details
TargetD(3) dopamine receptor
LigandBDBM50048301
Substrate/Competitorn/a
Meas. Tech.ChEMBL_62263 (CHEMBL675665)
Ki 56.7±n/a nM
Citation Wright, JLDowning, DMFeng, MRHayes, RNHeffner, TGMacKenzie, RGMeltzer, LTPugsley, TAWise, LD Identification, characterization and pharmacological profile of three metabolites of (R)-(+)-1,2,3,6-tetrahydro-4-phenyl-1-[(3-phenylcyclohexen-1- yl)methyl]pyridine (CI-1007), a dopamine autoreceptor agonist and potential antipsychotic agent. J Med Chem38:5007-14 (1996) D(3) dopamine receptor
Name:D(3) dopamine receptor
Type:n/a
Mol. Mass.:44243.43
Organism:Homo sapiens (Human)
Description:n/a
Residue:400
BDBM50048301
NameBDBM50048301
Synonyms:4-[1-((R)-3-Phenyl-cyclohex-3-enylmethyl)-1,2,3,6-tetrahydro-pyridin-4-yl]-phenol | CHEMBL356269
TypeSmall organic molecule
Emp. Form.C24H27NO
Mol. Mass.345.4773
SMILESOc1ccc(cc1)C1=CCN(C[C@@H]2CCC=C(C2)c2ccccc2)CC1