Reaction Details
TargetD(3) dopamine receptor
LigandBDBM50048302
Substrate/Competitorn/a
Meas. Tech.ChEMBL_62263 (CHEMBL675665)
Ki 0.52±n/a nM
Citation Wright, JLDowning, DMFeng, MRHayes, RNHeffner, TGMacKenzie, RGMeltzer, LTPugsley, TAWise, LD Identification, characterization and pharmacological profile of three metabolites of (R)-(+)-1,2,3,6-tetrahydro-4-phenyl-1-[(3-phenylcyclohexen-1- yl)methyl]pyridine (CI-1007), a dopamine autoreceptor agonist and potential antipsychotic agent. J Med Chem38:5007-14 (1996) D(3) dopamine receptor
Name:D(3) dopamine receptor
Type:n/a
Mol. Mass.:44243.43
Organism:Homo sapiens (Human)
Description:n/a
Residue:400
BDBM50048302
NameBDBM50048302
Synonyms:4-[(R)-5-(4-Phenyl-3,6-dihydro-2H-pyridin-1-ylmethyl)-cyclohex-1-enyl]-phenol | CHEMBL357416
TypeSmall organic molecule
Emp. Form.C24H27NO
Mol. Mass.345.4773
SMILESOc1ccc(cc1)C1=CCC[C@@H](CN2CCC(=CC2)c2ccccc2)C1