Reaction Details
TargetPotassium-transporting ATPase alpha chain 1/subunit beta
LigandBDBM50241343
Substrate/Competitorn/a
Meas. Tech.ChEMBL_76063 (CHEMBL688285)
IC50 3800±n/a nM
Citation Yamada, MYura, TMorimoto, MHarada, TYamada, KHonma, YKinoshita, MSugiura, M 2-[(2-Aminobenzyl)sulfinyl]-1-(2-pyridyl)-1,4,5,6-tetrahydrocyclopent[d]imidazoles as a novel class of gastric H+/K+-ATPase inhibitors. J Med Chem39:596-604 (1996) 
 
Potassium-transporting ATPase alpha chain 1/subunit beta
Name:Potassium-transporting ATPase alpha chain 1/subunit beta
Type:n/a
Mol. Mass.:n/a
Description:n/a
Components:This complex has 0 components.
Component 1
Name:Potassium-transporting ATPase subunit beta
Synonyms:ATP4B Gastric H(+)/K(+) ATPase subunit beta Potassium-transporting ATPase beta chain Proton pump beta chain | gp60-90
Type:n/a
Mol. Mass.:33083.09
Organism:Sus scrofa (Pig)
Description:n/a
Residue:290
Component 2
Name:Potassium-transporting ATPase alpha chain 1
Synonyms:ATP4A Gastric H(+)/K(+) ATPase subunit alpha Na/K-ATPase Potassium-transporting ATPase alpha chain 1 | Proton pump
Type:Enzyme
Mol. Mass.:114279.23
Organism:Sus scrofa (Pig)
Description:P19156
Residue:1034
BDBM50241343
NameBDBM50241343
Synonyms:(RS)-6-methoxy-2-((4-methoxy-3,5-dimethylpyridin-2-yl) methylsulfinyl)-1H-benzo[d]imidazole 2-(3-methoxy-2,4-dimethylbenzylsulfinyl)-6-methoxy-1H-benzo[d]imidazole 5-Methoxy-2-(4-methoxy-3,5-dimethyl-pyridin-2-ylmethanesulfinyl)-1H-benzoimidazole (omeprazole) 5-methoxy-2-((4-methoxy-3,5-dimethylpyridin-2-yl)methylsulfinyl)-1H-benzo[d]imidazole 6-methoxy-2-((4-methoxy-3,5-dimethylpyridin-2-yl)methylsulfinyl)-1H-benzo[d]imidazole ESOMEPRAZOLE SODIUM OMEPRAZOLE Prilosec | cid_4594
TypeSmall organic molecule
Emp. Form.C17H19N3O3S
Mol. Mass.345.416
SMILESCOc1ccc2nc([nH]c2c1)S(=O)Cc1ncc(C)c(OC)c1C