Reaction Details
TargetD(2) dopamine receptor
LigandBDBM50048803
Substrate/Competitorn/a
Meas. Tech.ChEMBL_62860 (CHEMBL677675)
Ki 4.8±n/a nM
Citation Howard, HRLowe, JASeeger, TFSeymour, PAZorn, SHMaloney, PREwing, FENewman, MESchmidt, AWFurman, JSRobinson, GLJackson, EJohnson, CMorrone, J 3-Benzisothiazolylpiperazine derivatives as potential atypical antipsychotic agents. J Med Chem39:143-8 (1996) 
 
D(2) dopamine receptor
Name:D(2) dopamine receptor
Type:G Protein-Coupled Receptor (GPCR)
Mol. Mass.:50931.60
Organism:Rattus norvegicus (rat)
Description:P61169
Residue:444
BDBM50048803
NameBDBM50048803
Synonyms:5-(2-(4-(benzo[d]isothiazol-3-yl)piperazin-1-yl)ethyl)-6-chloroindolin-2-one 5-[2-(4-Benzo[d]isothiazol-3-yl-piperazin-1-yl)-ethyl]-6-chloro-1,3-dihydro-indol-2-one (Ziprasidone) CHEMBL708 ZIPRASIDONE | ZIPRASIDONE HYDROCHLORIDE
TypeSmall organic molecule
Emp. Form.C21H21ClN4OS
Mol. Mass.412.936
SMILESClc1cc2NC(=O)Cc2cc1CCN1CCN(CC1)c1nsc2ccccc12