Reaction Details
TargetD(2) dopamine receptor
LigandBDBM50048807
Substrate/Competitorn/a
Meas. Tech.ChEMBL_62860 (CHEMBL677675)
Ki 3.1±n/a nM
Citation Howard, HRLowe, JASeeger, TFSeymour, PAZorn, SHMaloney, PREwing, FENewman, MESchmidt, AWFurman, JSRobinson, GLJackson, EJohnson, CMorrone, J 3-Benzisothiazolylpiperazine derivatives as potential atypical antipsychotic agents. J Med Chem39:143-8 (1996) 
 
D(2) dopamine receptor
Name:D(2) dopamine receptor
Type:G Protein-Coupled Receptor (GPCR)
Mol. Mass.:50931.60
Organism:Rattus norvegicus (rat)
Description:P61169
Residue:444
BDBM50048807
NameBDBM50048807
Synonyms:5-[2-(4-Benzo[d]isothiazol-3-yl-piperazin-1-yl)-ethyl]-3,3-dimethyl-1,3-dihydro-indol-2-one | CHEMBL37633
TypeSmall organic molecule
Emp. Form.C23H26N4OS
Mol. Mass.406.544
SMILESCC1(C)C(=O)Nc2ccc(CCN3CCN(CC3)c3nsc4ccccc34)cc12