Reaction Details
TargetDimer of Protein farnesyltransferase subunit beta
LigandBDBM50048982
Substrate/Competitorn/a
Meas. Tech.ChEMBL_70728 (CHEMBL680521)
IC50 0.37±n/a nM
Citation Leftheris, KKline, TVite, GDCho, YHBhide, RSPatel, DVPatel, MMSchmidt, RJWeller, HNAndahazy, MLCarboni, JMGullo-Brown, JLLee, FYRicca, CRose, WCYan, NBarbacid, MHunt, JTMeyers, CASeizinger, BRZahler, RManne, V Development of highly potent inhibitors of Ras farnesyltransferase possessing cellular and in vivo activity. J Med Chem39:224-36 (1996) 
 
Dimer of Protein farnesyltransferase subunit beta
Name:Dimer of Protein farnesyltransferase subunit beta
Synonyms:Protein Farnesyltransferase (PFT) Chain B
Type:n/a
Mol. Mass.:n/a
Description:ASSAY_ID of EBI is 51428
Components:This complex has 3 components.
Component 1
Name:Protein farnesyltransferase subunit beta
Type:Enzyme Subunit
Mol. Mass.:48766.02
Organism:Homo sapiens (Human)
Description:Protein farnesyltransferase subunit beta
Residue:437
Component 2
Name:Protein farnesyltransferase subunit beta
Synonyms:CAAX farnesyltransferase subunit alpha FNTB FTase-alpha GGTase-I-alpha Protein farnesyl/geranylgeranyl transferase Protein farnesyltransferase subunit beta Protein farnesyltransferase/geranylgeranyltransferase type-1 subunit alpha Ras proteins prenyltransferase subunit beta | Type I protein geranyl-geranyltransferase subunit alpha
Type:Enzyme Subunit
Mol. Mass.:48766.02
Organism:Homo sapiens (Human)
Description:Protein farnesyltransferase subunit beta
Residue:437
BDBM50048982
NameBDBM50048982
Synonyms:(R)-2-({(R)-2-[(R)-2-((S)-2-Amino-3-mercapto-propionylamino)-3-methyl-butyl]-1,2,3,4-tetrahydro-isoquinoline-3-carbonyl}-amino)-4-methylsulfanyl-butyric acid | CHEMBL76139
TypeSmall organic molecule
Emp. Form.C23H36N4O4S2
Mol. Mass.496.686
SMILESCSCC[C@@H](NC(=O)[C@H]1Cc2ccccc2CN1C[C@H](NC(=O)[C@H](N)CS)C(C)C)C(O)=O