Reaction Details
TargetGeranylgeranyl transferase type-1 subunit beta/Protein farnesyltransferase/geranylgeranyltransferase type-1 subunit alpha
LigandBDBM50048970
Substrate/Competitorn/a
Meas. Tech.ChEMBL_71976 (CHEMBL684169)
IC50 14±n/a nM
Citation Leftheris, KKline, TVite, GDCho, YHBhide, RSPatel, DVPatel, MMSchmidt, RJWeller, HNAndahazy, MLCarboni, JMGullo-Brown, JLLee, FYRicca, CRose, WCYan, NBarbacid, MHunt, JTMeyers, CASeizinger, BRZahler, RManne, V Development of highly potent inhibitors of Ras farnesyltransferase possessing cellular and in vivo activity. J Med Chem39:224-36 (1996) 
 
Geranylgeranyl transferase type-1 subunit beta/Protein farnesyltransferase/geranylgeranyltransferase type-1 subunit alpha
Name:Geranylgeranyl transferase type-1 subunit beta/Protein farnesyltransferase/geranylgeranyltransferase type-1 subunit alpha
Type:n/a
Mol. Mass.:n/a
Description:ASSAY_ID of EBI is 70196
Components:This complex has 2 components.
Component 1
Name:Protein farnesyltransferase/geranylgeranyltransferase type-1 subunit alpha
Synonyms:CAAX farnesyltransferase alpha subunit FNTA_HUMAN FTase-alpha Geranylgeranyl Transferase (GGTase-I) Chain A Protein Farnesyltransferase (PFT) Chain A Protein farnesyltransferase Protein farnesyltransferase/geranylgeranyltransferase type I alpha subunit | Ras proteins prenyltransferase alpha
Type:Enzyme
Mol. Mass.:44392.46
Organism:Homo sapiens (Human)
Description:Recombinant human FTase.
Residue:379
Component 2
Name:Geranylgeranyl transferase type-1 subunit beta
Synonyms:2.5.1.59 Geranylgeranyl transferase type I Geranylgeranyl transferase type I subunit beta PGGT1B Protein farnesyl/geranylgeranyl transferase | Type I protein geranyl-geranyltransferase subunit beta
Type:n/a
Mol. Mass.:42369.84
Organism:Homo sapiens (Human)
Description:n/a
Residue:377
BDBM50048970
NameBDBM50048970
Synonyms:(R)-2-({(S)-2-[(S)-2-((R)-2-Amino-3-mercapto-propylamino)-3,3-dimethyl-butyryl]-1,2,3,4-tetrahydro-isoquinoline-3-carbonyl}-amino)-4-methanesulfonyl-butyric acid | CHEMBL73862
TypeSmall organic molecule
Emp. Form.C24H38N4O6S2
Mol. Mass.542.712
SMILESCC(C)(C)[C@H](NC[C@@H](N)CS)C(=O)N1Cc2ccccc2C[C@H]1C(=O)N[C@H](CCS(C)(=O)=O)C(O)=O