Reaction Details
TargetProstaglandin G/H synthase 2
LigandBDBM50049022
Substrate/Competitorn/a
Meas. Tech.ChEMBL_159916 (CHEMBL768965)
IC50 4±n/a nM
Citation Huang, HCLi, JJGarland, DJChamberlain, TSReinhard, EJManning, RESeibert, KKoboldt, CMGregory, SAAnderson, GDVeenhuizen, AWZhang, YPerkins, WEBurton, EGCogburn, JNIsakson, PCReitz, DB Diarylspiro[2.4]heptenes as orally active, highly selective cyclooxygenase-2 inhibitors: synthesis and structure-activity relationships. J Med Chem39:253-66 (1996) 
 
Prostaglandin G/H synthase 2
Name:Prostaglandin G/H synthase 2
Type:Enzyme
Mol. Mass.:69003.89
Organism:Homo sapiens (Human)
Description:Recombinant Cox-2 provided by Cayman (Cayman Chemical Co.,Ann Arbor, MI).
Residue:604
BDBM50049022
NameBDBM50049022
Synonyms:6-(4-Fluoro-phenyl)-7-(4-methanesulfonyl-phenyl)-spiro[3.4]oct-6-ene | CHEMBL90447
TypeSmall organic molecule
Emp. Form.C21H21FO2S
Mol. Mass.356.454
SMILESCS(=O)(=O)c1ccc(cc1)C1=C(CC2(CCC2)C1)c1ccc(F)cc1