Reaction Details
Target5-hydroxytryptamine receptor 1D
LigandBDBM50049075
Substrate/Competitorn/a
Meas. Tech.ChEMBL_1997 (CHEMBL617599)
Ki 55±n/a nM
Citation Glennon, RAHong, SSBondarev, MLaw, HDukat, MRakhi, SPower, PFan, EKinneau, DKamboj, RTeitler, MHerrick-Davis, KSmith, C Binding of O-alkyl derivatives of serotonin at human 5-HT1D beta receptors. J Med Chem39:314-22 (1996) 
 
5-hydroxytryptamine receptor 1D
Name:5-hydroxytryptamine receptor 1D
Type:G Protein-Coupled Receptor (GPCR)
Mol. Mass.:41920.63
Organism:Homo sapiens (Human)
Description:Receptor binding assays were performed using human clone stably expressed in CHO cells.
Residue:377
BDBM50049075
NameBDBM50049075
Synonyms:2-[5-(4-Cyclohexyl-butoxy)-1H-indol-3-yl]-ethylamine | CHEMBL110318
TypeSmall organic molecule
Emp. Form.C20H30N2O
Mol. Mass.314.465
SMILESNCCc1c[nH]c2ccc(OCCCCC3CCCCC3)cc12