Reaction Details
Target5-hydroxytryptamine receptor 1D
LigandBDBM30707
Substrate/Competitorn/a
Meas. Tech.ChEMBL_1628 (CHEMBL616514)
Ki 20±n/a nM
Citation Glennon, RAHong, SSBondarev, MLaw, HDukat, MRakhi, SPower, PFan, EKinneau, DKamboj, RTeitler, MHerrick-Davis, KSmith, C Binding of O-alkyl derivatives of serotonin at human 5-HT1D beta receptors. J Med Chem39:314-22 (1996) 
 
5-hydroxytryptamine receptor 1D
Name:5-hydroxytryptamine receptor 1D
Type:G Protein-Coupled Receptor (GPCR)
Mol. Mass.:41920.63
Organism:Homo sapiens (Human)
Description:Receptor binding assays were performed using human clone stably expressed in CHO cells.
Residue:377
BDBM30707
NameBDBM30707
Synonyms:2-(5-methoxy-1H-indol-3-yl)-N,N-dimethyl-ethanamine 2-(5-methoxy-1H-indol-3-yl)ethyl-dimethyl-amine CHEMBL7257 Methoxydimethyltryptamines WO2023019367, Compound 5-MeO-DMT | cid_1832
TypeSmall organic molecule
Emp. Form.C13H18N2O
Mol. Mass.218.2948
SMILESCOc1ccc2[nH]cc(CCN(C)C)c2c1