Reaction Details
Target5-hydroxytryptamine receptor 1D
LigandBDBM50049097
Substrate/Competitorn/a
Meas. Tech.ChEMBL_1628 (CHEMBL616514)
Ki 31±n/a nM
Citation Glennon, RAHong, SSBondarev, MLaw, HDukat, MRakhi, SPower, PFan, EKinneau, DKamboj, RTeitler, MHerrick-Davis, KSmith, C Binding of O-alkyl derivatives of serotonin at human 5-HT1D beta receptors. J Med Chem39:314-22 (1996) 
 
5-hydroxytryptamine receptor 1D
Name:5-hydroxytryptamine receptor 1D
Type:G Protein-Coupled Receptor (GPCR)
Mol. Mass.:41920.63
Organism:Homo sapiens (Human)
Description:Receptor binding assays were performed using human clone stably expressed in CHO cells.
Residue:377
BDBM50049097
NameBDBM50049097
Synonyms:Acetic acid 3-(2-dimethylamino-ethyl)-1H-indol-5-yl ester | CHEMBL111000
TypeSmall organic molecule
Emp. Form.C14H18N2O2
Mol. Mass.246.3049
SMILESCN(C)CCc1c[nH]c2ccc(OC(C)=O)cc12