Reaction Details
Target5-hydroxytryptamine receptor 1B
LigandBDBM50049100
Substrate/Competitorn/a
Meas. Tech.ChEMBL_2026 (CHEMBL617321)
Ki 10±n/a nM
Citation Glennon, RAHong, SSBondarev, MLaw, HDukat, MRakhi, SPower, PFan, EKinneau, DKamboj, RTeitler, MHerrick-Davis, KSmith, C Binding of O-alkyl derivatives of serotonin at human 5-HT1D beta receptors. J Med Chem39:314-22 (1996) 
 
5-hydroxytryptamine receptor 1B
Name:5-hydroxytryptamine receptor 1B
Type:G Protein-Coupled Receptor (GPCR)
Mol. Mass.:43579.17
Organism:Homo sapiens (Human)
Description:Receptor binding assays were performed using human clone stably expressed in CHO cells
Residue:390
BDBM50049100
NameBDBM50049100
Synonyms:6-Amino-6,7,8,9-tetrahydro-5H-carbazole-3-carboxylic acid amide | CHEMBL111316
TypeSmall organic molecule
Emp. Form.C13H15N3O
Mol. Mass.229.2777
SMILESNC1CCc2[nH]c3ccc(cc3c2C1)C(N)=O