Reaction Details
Target5-hydroxytryptamine receptor 1A
LigandBDBM50049091
Substrate/Competitorn/a
Meas. Tech.ChEMBL_910 (CHEMBL615759)
Ki 38±n/a nM
Citation Glennon, RAHong, SSBondarev, MLaw, HDukat, MRakhi, SPower, PFan, EKinneau, DKamboj, RTeitler, MHerrick-Davis, KSmith, C Binding of O-alkyl derivatives of serotonin at human 5-HT1D beta receptors. J Med Chem39:314-22 (1996) 
 
5-hydroxytryptamine receptor 1A
Name:5-hydroxytryptamine receptor 1A
Type:n/a
Mol. Mass.:46122.49
Organism:Homo sapiens (Human)
Description:n/a
Residue:422
BDBM50049091
NameBDBM50049091
Synonyms:2-(5-Heptyloxy-1H-indol-3-yl)-ethylamine | CHEMBL320079
TypeSmall organic molecule
Emp. Form.C17H26N2O
Mol. Mass.274.4011
SMILESCCCCCCCOc1ccc2[nH]cc(CCN)c2c1