Reaction Details
TargetPeroxisome proliferator-activated receptor gamma
LigandBDBM50049247
Substrate/Competitorn/a
Meas. Tech.ChEMBL_154537 (CHEMBL760257)
EC50 10000±n/a nM
Citation Willson, TMCobb, JECowan, DJWiethe, RWCorrea, IDPrakash, SRBeck, KDMoore, LBKliewer, SALehmann, JM The structure-activity relationship between peroxisome proliferator-activated receptor gamma agonism and the antihyperglycemic activity of thiazolidinediones. J Med Chem39:665-8 (1996) 
 
Peroxisome proliferator-activated receptor gamma
Name:Peroxisome proliferator-activated receptor gamma
Type:PROTEIN
Mol. Mass.:57593.55
Organism:Mus musculus
Description:ChEMBL_1453700
Residue:505
BDBM50049247
NameBDBM50049247
Synonyms:5-{4-[2-(Benzooxazol-2-yl-methyl-amino)-ethoxy]-phenyl}-thiazolidine-2,4-dione | CHEMBL129562
TypeSmall organic molecule
Emp. Form.C19H17N3O4S
Mol. Mass.383.421
SMILESCN(CCOc1ccc(cc1)-c1sc(=O)[nH]c1O)c1nc2ccccc2o1