Reaction Details
TargetPeroxisome proliferator-activated receptor gamma
LigandBDBM50049241
Substrate/Competitorn/a
Meas. Tech.ChEMBL_154537 (CHEMBL760257)
EC50 110000±n/a nM
Citation Willson, TMCobb, JECowan, DJWiethe, RWCorrea, IDPrakash, SRBeck, KDMoore, LBKliewer, SALehmann, JM The structure-activity relationship between peroxisome proliferator-activated receptor gamma agonism and the antihyperglycemic activity of thiazolidinediones. J Med Chem39:665-8 (1996) 
 
Peroxisome proliferator-activated receptor gamma
Name:Peroxisome proliferator-activated receptor gamma
Type:PROTEIN
Mol. Mass.:57593.55
Organism:Mus musculus
Description:ChEMBL_1453700
Residue:505
BDBM50049241
NameBDBM50049241
Synonyms:4-[4-(4-Chloro-phenoxy)-phenyl]-4-oxo-butyric acid | CHEMBL346267
TypeSmall organic molecule
Emp. Form.C16H13ClO4
Mol. Mass.304.725
SMILESOC(=O)CCC(=O)c1ccc(Oc2ccc(Cl)cc2)cc1