Reaction Details
TargetDNA topoisomerase 1
LigandBDBM50049293
Substrate/Competitorn/a
Meas. Tech.ChEMBL_53713 (CHEMBL663641)
IC50 250±n/a nM
Citation Lackey, KSternbach, DDCroom, DKEmerson, DLEvans, MGLeitner, PLLuzzio, MJMcIntyre, GVuong, AYates, JBesterman, JM Water soluble inhibitors of topoisomerase I: quaternary salt derivatives of camptothecin. J Med Chem39:713-9 (1996) 
 
DNA topoisomerase 1
Name:DNA topoisomerase 1
Type:Enzyme
Mol. Mass.:90771.02
Organism:Homo sapiens (Human)
Description:P11387
Residue:765
BDBM50049293
NameBDBM50049293
Synonyms:8-ethyl-8-hydroxy-15-pyridazin-1-ium-1-ylmethyl-(8S)-2,3,8,9,12,14-hexahydro-11H-[1,4]dioxino[3,2-g]pyrano[3',4':6,7]indolizino[1,2-b]quinoline-9,12-dione | CHEMBL163162
TypeSmall organic molecule
Emp. Form.C27H23N4O6
Mol. Mass.499.4942
SMILESCC[C@@]1(O)C(=O)OCc2c1cc1-c3nc4cc5OCCOc5cc4c(C[n+]4ccccn4)c3Cn1c2=O