Reaction Details
TargetDNA topoisomerase 1
LigandBDBM50049295
Substrate/Competitorn/a
Meas. Tech.ChEMBL_53713 (CHEMBL663641)
IC50 100±n/a nM
Citation Lackey, KSternbach, DDCroom, DKEmerson, DLEvans, MGLeitner, PLLuzzio, MJMcIntyre, GVuong, AYates, JBesterman, JM Water soluble inhibitors of topoisomerase I: quaternary salt derivatives of camptothecin. J Med Chem39:713-9 (1996) 
 
DNA topoisomerase 1
Name:DNA topoisomerase 1
Type:Enzyme
Mol. Mass.:90771.02
Organism:Homo sapiens (Human)
Description:P11387
Residue:765
BDBM50049295
NameBDBM50049295
Synonyms:7-ethyl-7-hydroxy-14-(3-hydroxymethyl-1-pyridiniumylmethyl)-(7S)-7,8,11,13-tetrahydro-10H-[1,3]dioxolo[5,4-g]pyrano[3',4':6,7]indolizino[1,2-b]quinoline-8,11-dione | CHEMBL422886
TypeSmall organic molecule
Emp. Form.C28H24N3O7
Mol. Mass.514.5055
SMILESCC[C@@]1(O)C(=O)OCc2c1cc1-c3nc4cc5OCOc5cc4c(C[n+]4cccc(CO)c4)c3Cn1c2=O