Reaction Details
TargetDNA topoisomerase 1
LigandBDBM50049294
Substrate/Competitorn/a
Meas. Tech.ChEMBL_53714 (CHEMBL663642)
IC50 190±n/a nM
Citation Lackey, KSternbach, DDCroom, DKEmerson, DLEvans, MGLeitner, PLLuzzio, MJMcIntyre, GVuong, AYates, JBesterman, JM Water soluble inhibitors of topoisomerase I: quaternary salt derivatives of camptothecin. J Med Chem39:713-9 (1996) 
 
DNA topoisomerase 1
Name:DNA topoisomerase 1
Type:Enzyme
Mol. Mass.:90771.02
Organism:Homo sapiens (Human)
Description:P11387
Residue:765
BDBM50049294
NameBDBM50049294
Synonyms:8-ethyl-8-hydroxy-15-(1-pyridiniumylmethyl)-(8S)-2,3,8,9,12,14-hexahydro-11H-[1,4]dioxino[3,2-g]pyrano[3',4':6,7]indolizino[1,2-b]quinoline-9,12-dione | CHEMBL423808
TypeSmall organic molecule
Emp. Form.C28H24N3O6
Mol. Mass.498.5061
SMILESCC[C@@]1(O)C(=O)OCc2c1cc1-c3nc4cc5OCCOc5cc4c(C[n+]4ccccc4)c3Cn1c2=O