Reaction Details
TargetDNA topoisomerase 1
LigandBDBM50049304
Substrate/Competitorn/a
Meas. Tech.ChEMBL_53713 (CHEMBL663641)
IC50 160±n/a nM
Citation Lackey, KSternbach, DDCroom, DKEmerson, DLEvans, MGLeitner, PLLuzzio, MJMcIntyre, GVuong, AYates, JBesterman, JM Water soluble inhibitors of topoisomerase I: quaternary salt derivatives of camptothecin. J Med Chem39:713-9 (1996) 
 
DNA topoisomerase 1
Name:DNA topoisomerase 1
Type:Enzyme
Mol. Mass.:90771.02
Organism:Homo sapiens (Human)
Description:P11387
Residue:765
BDBM50049304
NameBDBM50049304
Synonyms:7-ethyl-7-hydroxy-14-(1H-1-imidazolylmethyl)-(7S)-7,8,11,13-tetrahydro-10H-[1,3]dioxolo[5,4-g]pyrano[3',4':6,7]indolizino[1,2-b]quinoline-8,11-dione | CHEMBL349601
TypeSmall organic molecule
Emp. Form.C25H20N4O6
Mol. Mass.472.4495
SMILESCC[C@@]1(O)C(=O)OCc2c1cc1-c3nc4cc5OCOc5cc4c(Cn4ccnc4)c3Cn1c2=O