Reaction Details
TargetSubstance-P receptor
LigandBDBM50049347
Substrate/Competitorn/a
Meas. Tech.ChEMBL_205731 (CHEMBL809498)
IC50 1.9±n/a nM
Citation Hipskind, PAHowbert, JJBruns, RFCho, SSCrowell, TAForeman, MMGehlert, DRIyengar, SJohnson, KWKrushinski, JHLi, DLLobb, KLMason, NRMuehl, BSNixon, JAPhebus, LARegoli, DSimmons, RMThrelkeld, PGWaters, DCGitter, BD 3-Aryl-1,2-diacetamidopropane derivatives as novel and potent NK-1 receptor antagonists. J Med Chem39:736-48 (1996) 
 
Substance-P receptor
Name:Substance-P receptor
Type:G Protein-Coupled Receptor (GPCR)
Mol. Mass.:46254.43
Organism:Homo sapiens (Human)
Description:P25103
Residue:407
BDBM50049347
NameBDBM50049347
Synonyms:CHEMBL165498 | N-[1-{[Acetyl-(2-chloro-benzyl)-amino]-methyl}-2-(1H-indol-3-yl)-ethyl]-2-(4-phenyl-piperazin-1-yl)-acetamide
TypeSmall organic molecule
Emp. Form.C32H36ClN5O2
Mol. Mass.558.114
SMILESCC(=O)N(CC(Cc1c[nH]c2ccccc12)NC(=O)CN1CCN(CC1)c1ccccc1)Cc1ccccc1Cl