Reaction Details
TargetSubstance-P receptor
LigandBDBM50049348
Substrate/Competitorn/a
Meas. Tech.ChEMBL_205731 (CHEMBL809498)
IC50 4±n/a nM
Citation Hipskind, PAHowbert, JJBruns, RFCho, SSCrowell, TAForeman, MMGehlert, DRIyengar, SJohnson, KWKrushinski, JHLi, DLLobb, KLMason, NRMuehl, BSNixon, JAPhebus, LARegoli, DSimmons, RMThrelkeld, PGWaters, DCGitter, BD 3-Aryl-1,2-diacetamidopropane derivatives as novel and potent NK-1 receptor antagonists. J Med Chem39:736-48 (1996) 
 
Substance-P receptor
Name:Substance-P receptor
Type:G Protein-Coupled Receptor (GPCR)
Mol. Mass.:46254.43
Organism:Homo sapiens (Human)
Description:P25103
Residue:407
BDBM50049348
NameBDBM50049348
Synonyms:CHEMBL166240 | N-{1-(1H-Indol-3-ylmethyl)-2-[methanesulfonyl-(2-methoxy-benzyl)-amino]-ethyl}-2-(4-phenyl-piperazin-1-yl)-acetamide
TypeSmall organic molecule
Emp. Form.C32H39N5O4S
Mol. Mass.589.748
SMILESCOc1ccccc1CN(CC(Cc1c[nH]c2ccccc12)NC(=O)CN1CCN(CC1)c1ccccc1)S(C)(=O)=O