Reaction Details
TargetMu-type opioid receptor
LigandBDBM50049376
Substrate/Competitorn/a
Meas. Tech.ChEMBL_146983 (CHEMBL873627)
IC50 140±n/a nM
Citation Breveglieri, AGuerrini, RSalvadori, SBianchi, CBryant, SDAttila, MLazarus, LH Design and synthesis of 1-aminocycloalkane-1-carboxylic acid-substituted deltorphin analogues: unique delta and mu opioid activity in modified peptides. J Med Chem39:773-80 (1996) 
 
Mu-type opioid receptor
Name:Mu-type opioid receptor
Type:Enzyme Catalytic Domain
Mol. Mass.:11165.58
Organism:GUINEA PIG
Description:P97266
Residue:98
BDBM50049376
NameBDBM50049376
Synonyms:1-((S)-2-{(S)-2-[(S)-2-Amino-3-(4-hydroxy-phenyl)-propionylamino]-propionylamino}-3-phenyl-propionylamino)-cyclopentanecarboxylic acid {(S)-1-[(S)-1-(carbamoylmethyl-carbamoyl)-2-methyl-propylcarbamoyl]-2-methyl-propyl}-amide | CHEMBL164062
TypeSmall organic molecule
Emp. Form.C39H56N8O8
Mol. Mass.764.9107
SMILESCC(C)[C@H](NC(=O)[C@@H](NC(=O)C1(CCCC1)NC(=O)[C@H](Cc1ccccc1)NC(=O)[C@H](C)NC(=O)[C@@H](N)Cc1ccc(O)cc1)C(C)C)C(=O)NCC(N)=O