Reaction Details
TargetMu-type opioid receptor
LigandBDBM50049380
Substrate/Competitorn/a
Meas. Tech.ChEMBL_149012 (CHEMBL758576)
Ki 440667.0±n/a nM
Citation Breveglieri, AGuerrini, RSalvadori, SBianchi, CBryant, SDAttila, MLazarus, LH Design and synthesis of 1-aminocycloalkane-1-carboxylic acid-substituted deltorphin analogues: unique delta and mu opioid activity in modified peptides. J Med Chem39:773-80 (1996) 
 
Mu-type opioid receptor
Name:Mu-type opioid receptor
Type:G Protein-Coupled Receptor (GPCR)
Mol. Mass.:44503.11
Organism:Rattus norvegicus (rat)
Description:Competition binding assays were carried out using membrane preparations from transfected HN9.10 cells that constitutively expressed the mu opioid receptor.
Residue:398
BDBM50049380
NameBDBM50049380
Synonyms:(S)-3-({1-[(S)-2-Amino-3-(4-hydroxy-phenyl)-propionylamino]-cyclohexanecarbonyl}-amino)-N-{(S)-1-[(S)-1-(carbamoylmethyl-carbamoyl)-2-methyl-propylcarbamoyl]-2-methyl-propyl}-succinamic acid | CHEMBL165039
TypeSmall organic molecule
Emp. Form.C32H49N7O9
Mol. Mass.675.773
SMILESCC(C)[C@H](NC(=O)[C@@H](NC(=O)[C@H](CC(O)=O)NC(=O)C1(CCCCC1)NC(=O)[C@@H](N)Cc1ccc(O)cc1)C(C)C)C(=O)NCC(N)=O